{"text_format":"1","workbook":"xlsx","n_sheets":23,"sheets":["OBSAH","Cenová ponuka","Objednávka","Lakoplastovaný odkvapový systém","Pozinkovaný odkvapový systém","Pozinkovaný odkvapový systém La","CEDA","COROTOP","GALECO STAL2","GALECO NOVA","GALECO PVC2","GALECO PVC","KRONOPLAST-hlavice, priechodky","KRONOPLAST-ostatné","BAUDER - asfaltové pásy","BAUDER - PVC,TPO fólie","BAUDER - PIR","BAUDER - PIR SD","BAUDER - LES","PLECHY","STREŠNÉ KRYTINY","DOPLNKY KU KRYTINÁM","EVROMAT strešné krytiny"],"not_rendered":{"charts":0,"images":441,"macros":1,"external_links":2,"defined_names":1,"comments":2,"pivot_tables":0},"unopened":[],"bounds":{"document_bytes":16777216,"sheet_cells":100000,"rows_first":2000,"rows_last":500,"rows_between":2000,"halvings":0,"cell_chars":16384,"cell_head_chars":4096},"cells_cut":0,"cells_raw":0,"read":"whole","date_system":"1900"}

{"sheet":"OBSAH","index":0,"n_rows":2,"n_cols":1,"rows_kept":2,"cut":false,"hidden":false,"merged":[]}
[]
[3]

{"sheet":"Cenová ponuka","index":1,"n_rows":2,"n_cols":8,"rows_kept":2,"cut":false,"hidden":false,"merged":[[0,3,0,4],[0,0,0,1]]}
["CENOVÁ PONUKA ",null,"Firma:","TEST",null,null,null,10]
["Tovar","PLU","Množ.","Cena za MJ","Cena spolu "]

{"sheet":"Objednávka","index":2,"n_rows":2,"n_cols":5,"rows_kept":2,"cut":false,"hidden":false,"merged":[[0,3,0,4]]}
["OBJEDNÁVKA",null,"Firma:","TEST"]
["Tovar","PLU","Množ.","Cena za MJ","Cena spolu "]

{"sheet":"Lakoplastovaný odkvapový systém","index":3,"n_rows":62,"n_cols":16,"rows_kept":62,"cut":false,"hidden":false,"merged":[[60,15,61,15],[57,15,59,15],[6,5,6,14],[47,15,49,15],[44,15,46,15],[41,15,43,15],[51,15,53,15],[38,15,40,15],[20,15,28,15],[18,15,19,15],[55,15,56,15],[35,15,37,15],[33,15,34,15],[31,15,32,15],[29,15,30,15]]}
[null,null,null,null,null,null,null,null,null,null,null,null,null,null,null,"Vaša zľava v %"]
[null,null,null,null,null,null,null,null,null,null,null,null,null,null,null,0]
[null,null,null,null,null,null,null,null,null,null,null,null,null,null,null,"Ceny sú uvádzané bez DPH."]
[]
[]
[]
[null,"Lakoplastovaný odkvapový systém",null,null,null,"Objednané množstvá"]
["PLU","Model","Cena ","Cena po zľave","MJ",3009,5010,7016,8004,8017,8019,9005,9006,9010,8028,"Obrázok"]
["5ffff022","Žľab polkruhový  | 250 mm | 2 m",{"$f":"_xlfn.XLOOKUP(VALUE(REPLACE(A9,2,4,9005)),'[1]Worksheet 1'!$A$2:$A$18880,'[1]Worksheet 1'!$C$2:$C$18880)","v":10.4},{"$f":"IFERROR(C9*(1-$P$2/100),\"-\")","v":10.4},"ks"]
["5ffff023","Žľab polkruhový  | 250 mm | 3 m",{"$f":"_xlfn.XLOOKUP(VALUE(REPLACE(A10,2,4,9005)),'[1]Worksheet 1'!$A$2:$A$18880,'[1]Worksheet 1'!$C$2:$C$18880)","v":15.6},15.6,"ks"]
{"$rows_left_out":53}
{"sheet":"Pozinkovaný odkvapový systém","index":4,"n_rows":104,"n_cols":8,"rows_kept":104,"cut":false,"hidden":false,"merged":[[28,6,29,6],[31,6,45,6],[24,6,27,6],[8,6,23,6],[6,1,6,6],[46,6,53,6],[54,6,57,6],[58,6,59,6],[60,6,61,6],[62,6,67,6],[68,6,69,6],[70,6,74,6],[75,6,79,6],[81,6,83,6],[85,6,87,6],[88,6,90,6],[91,6,93,6],[94,6,99,6],[100,6,101,6],[102,6,103,6]]}
[null,null,null,null,null,null,null,"Vaša zľava v %"]
[null,null,null,null,null,null,null,0]
[null,null,null,null,null,null,null,"Ceny sú uvádzané bez DPH."]
[]
[]
[]
[null,"Pozinkovaný odkvapový systém "]
["PLU","Model","Cena ","Cena po zľave","MJ","Objednané množstvá","Obrázok"]
[60000011,"PZ žľab polkruhový | 200 mm | 1 m",{"$f":"_xlfn.XLOOKUP(A9,'[1]Worksheet 1'!$A$2:$A$18880,'[1]Worksheet 1'!$C$2:$C$18880)","v":3.8},{"$f":"C9*(1-$H$2/100)","v":3.8},"ks"]
[60000012,"PZ žľab polkruhový | 200 mm | 2 m",{"$f":"_xlfn.XLOOKUP(A10,'[1]Worksheet 1'!$A$2:$A$18880,'[1]Worksheet 1'!$C$2:$C$18880)","v":7.6},7.6,"ks"]
{"$rows_left_out":95}
{"sheet":"Pozinkovaný odkvapový systém La","index":5,"n_rows":69,"n_cols":8,"rows_kept":69,"cut":false,"hidden":false,"merged":[[8,6,9,6],[10,6,11,6],[16,6,17,6],[21,6,22,6],[23,6,24,6],[6,1,6,6],[67,6,68,6],[46,6,48,6],[49,6,51,6],[35,6,37,6],[52,6,57,6],[42,6,44,6],[38,6,40,6],[58,6,66,6],[25,6,27,6],[28,6,29,6],[30,6,32,6],[33,6,34,6],[12,6,13,6],[14,6,15,6],[18,6,20,6]]}
[null,null,null,null,null,null,null,"Vaša zľava v %"]
[null,null,null,null,null,null,null,0]
[null,null,null,null,null,null,null,"Ceny sú uvádzané bez DPH."]
[]
[]
[]
[null,"Pozinkovaný odkvapový systém Lamina s návalkammi dovnútra"]
["PLU","Model","Cena ","Cena po zľave","MJ","Objednané množstvá","Obrázok"]
[4,"PZ žľab polkruhový | 250 mm | 2 m",{"$f":"_xlfn.XLOOKUP(A9,'[1]Worksheet 1'!$A$2:$A$18880,'[1]Worksheet 1'!$C$2:$C$18880)","v":8.6999999999999993},{"$f":"C9*(1-$H$2/100)","v":8.6999999999999993},"ks"]
[2,"PZ žľab polkruhový | 330 mm | 2 m",{"$f":"_xlfn.XLOOKUP(A10,'[1]Worksheet 1'!$A$2:$A$18880,'[1]Worksheet 1'!$C$2:$C$18880)","v":10.8},10.8,"ks"]
{"$rows_left_out":60}
{"sheet":"CEDA","index":6,"n_rows":91,"n_cols":10,"rows_kept":91,"cut":false,"hidden":false,"merged":[[86,1,86,9],[80,1,80,9],[6,1,6,9],[8,9,13,9],[14,9,19,9],[20,9,22,9],[57,9,63,9],[65,9,71,9],[72,9,78,9],[48,1,48,9],[50,9,56,9],[24,9,29,9],[30,9,35,9],[36,9,38,9]]}
[null,null,null,null,null,null,null,"Vaša zľava v %"]
[null,null,null,null,null,null,null,0]
[null,null,null,null,null,null,null,"Ceny sú uvádzané bez DPH."]
[]
[]
[]
[null,"Snehové zábrany"]
["PLU","Model","Cena","Cena po zľave","Farba","Výška zámku",null,"MJ","Objednané množstvá","Obrázok"]
[1230090201,"SNEHOVÝ SET pre CLIP PANEL - 240 cm",{"$f":"_xlfn.XLOOKUP(A9,'[1]Worksheet 1'!$A$2:$A$18880,'[1]Worksheet 1'!$C$2:$C$18880)","v":133.6},{"$f":"C9*(1-$H$2/100)","v":133.6},"RAL 3009","32 mm",null,"ks"]
[1270160201,"SNEHOVÝ SET pre CLIP PANEL - 240 cm",{"$f":"_xlfn.XLOOKUP(A10,'[1]Worksheet 1'!$A$2:$A$18880,'[1]Worksheet 1'!$C$2:$C$18880)","v":133.6},133.6,"RAL 7016","32 mm",null,"ks"]
{"$rows_left_out":82}
{"sheet":"COROTOP","index":7,"n_rows":55,"n_cols":9,"rows_kept":55,"cut":false,"hidden":false,"merged":[[19,1,19,8],[28,1,28,8],[36,1,36,8],[41,1,41,8],[6,1,6,8]]}
[null,null,null,null,null,null,null,"Vaša zľava v %"]
[null,null,null,null,null,null,null,0]
[null,null,null,null,null,null,null,"Ceny sú uvádzané bez DPH."]
[]
[]
[]
[null,"Strešné fólie"]
["PLU","Model","Cena","Cena po zľave","Hmotnosť","Sklon strechy","MJ","Objednané množstvá","Obrázok"]
[7221,"Fólia Corotop CLASSIC 130; 1,5 x 50m",{"$f":"_xlfn.XLOOKUP(A9,'[1]Worksheet 1'!$A$2:$A$18880,'[1]Worksheet 1'!$C$2:$C$18880)","v":60},{"$f":"C9*(1-$H$2/100)","v":60},"130g/m2    ","≥ 35°","rol"]
[7222,"Fólia s páskou  Corotop CLASSIC Plus 130; 1,5 x 50m",{"$f":"_xlfn.XLOOKUP(A10,'[1]Worksheet 1'!$A$2:$A$18880,'[1]Worksheet 1'!$C$2:$C$18880)","v":80},{"$f":"C10*(1-$H$2/100)","v":80},"130g/m2    ","≥ 35°","rol"]
{"$rows_left_out":46}
{"sheet":"GALECO STAL2","index":8,"n_rows":65,"n_cols":8,"rows_kept":65,"cut":false,"hidden":false,"merged":[[29,7,31,7],[6,1,6,7],[53,7,55,7],[56,7,58,7],[59,7,61,7],[32,7,34,7],[8,7,13,7],[14,7,22,7],[23,7,25,7],[26,7,28,7],[62,7,64,7],[35,7,37,7],[38,7,40,7],[41,7,43,7],[44,7,46,7],[47,7,49,7],[50,7,52,7]]}
[null,null,null,null,null,null,null,"Vaša zľava v %"]
[null,null,null,null,null,null,null,0]
[null,null,null,null,null,null,null,"Ceny sú uvádzané bez DPH."]
[]
[]
[]
[null,"GALECO STAL2"]
["PLU","Model","Cena","Cena po zľave","Farba","MJ","Objednané množstvá","Obrázok"]
[187015013,"Hranatý žľab 125 3bm",{"$f":"_xlfn.XLOOKUP(A9,'[1]Worksheet 1'!$A$2:$A$18880,'[1]Worksheet 1'!$C$2:$C$18880)","v":35.5},{"$f":"C9*(1-$H$2/100)","v":35.5},"RAL 7015","ks"]
[189005013,"Hranatý žľab 125 3bm",{"$f":"_xlfn.XLOOKUP(A10,'[1]Worksheet 1'!$A$2:$A$18880,'[1]Worksheet 1'!$C$2:$C$18880)","v":35.5},{"$f":"C10*(1-$H$2/100)","v":35.5},"RAL 9005","ks"]
{"$rows_left_out":56}
{"sheet":"GALECO NOVA","index":9,"n_rows":48,"n_cols":8,"rows_kept":48,"cut":false,"hidden":false,"merged":[[6,1,6,7],[32,7,39,7],[40,7,47,7],[8,7,15,7],[16,7,23,7],[24,7,31,7]]}
[null,null,null,null,null,null,null,"Vaša zľava v %"]
[null,null,null,null,null,null,null,0]
[null,null,null,null,null,null,null,"Ceny sú uvádzané bez DPH."]
[]
[]
[]
[null,"GALECO NOVA"]
["PLU","Model","Cena","Cena po zľave","Farba","MJ","Objednané množstvá","Obrázok"]
[149010100,"Strešný podhľad 295x4000 mm",{"$f":"_xlfn.XLOOKUP(A9,'[1]Worksheet 1'!$A$2:$A$18880,'[1]Worksheet 1'!$C$2:$C$18880)","v":23.5},{"$f":"C9*(1-$H$2/100)","v":23.5},"Biela","ks"]
[149020100,"Strešný podhľad 295x4000 mm",{"$f":"_xlfn.XLOOKUP(A10,'[1]Worksheet 1'!$A$2:$A$18880,'[1]Worksheet 1'!$C$2:$C$18880)","v":27},{"$f":"C10*(1-$H$2/100)","v":27},"Biely dub","ks"]
{"$rows_left_out":39}
{"sheet":"GALECO PVC2","index":10,"n_rows":38,"n_cols":8,"rows_kept":38,"cut":false,"hidden":false,"merged":[[8,7,11,7],[12,7,17,7],[18,7,19,7],[20,7,21,7],[6,1,6,7],[22,7,23,7],[36,7,37,7],[24,7,25,7],[26,7,27,7],[28,7,29,7],[30,7,31,7],[32,7,33,7],[34,7,35,7]]}
[null,null,null,null,null,null,null,"Vaša zľava v %"]
[null,null,null,null,null,null,null,0]
[null,null,null,null,null,null,null,"Ceny sú uvádzané bez DPH."]
[]
[]
[]
[null,"GALECO PVC2"]
["PLU","Model","Cena","Cena po zľave","Farba","MJ","Objednané množstvá","Obrázok"]
[167021013,"Hranatý žľab 135 3bm",{"$f":"_xlfn.XLOOKUP(A9,'[1]Worksheet 1'!$A$2:$A$18880,'[1]Worksheet 1'!$C$2:$C$18880)","v":24},{"$f":"C9*(1-$H$2/100)","v":24},"RAL 7021","ks"]
[169005013,"Hranatý žľab 135 3bm",24,{"$f":"C10*(1-$H$2/100)","v":24},"RAL 9005","ks"]
{"$rows_left_out":29}
{"sheet":"GALECO PVC","index":11,"n_rows":73,"n_cols":10,"rows_kept":73,"cut":false,"hidden":false,"merged":[[67,9,69,9],[70,9,72,9],[41,9,44,9],[45,9,48,9],[49,9,52,9],[53,9,56,9],[57,9,60,9],[28,9,31,9],[32,9,36,9],[37,9,40,9],[61,9,63,9],[64,9,66,9],[6,1,6,5],[6,6,6,8],[8,9,14,9],[15,9,23,9],[24,9,27,9]]}
[null,null,null,null,null,null,null,"Vaša zľava v %"]
[null,null,null,null,null,null,null,0]
[null,null,null,null,null,null,null,"Ceny sú uvádzané bez DPH."]
[]
[]
[]
[null,"GALECO PVC",null,null,null,null,"Objednané množstvá"]
["PLU","Model","Cena","Cena po zľave","Rozmer","MJ",7021,8019,9005,"Obrázok"]
["15ffff013","Žľab 3bm",{"$f":"_xlfn.XLOOKUP(VALUE(REPLACE(A9,3,4,7021)),'[1]Worksheet 1'!$A$2:$A$18880,'[1]Worksheet 1'!$C$2:$C$18880)","v":8.1999999999999993},{"$f":"C9*(1-$H$2/100)","v":8.1999999999999993},90,"ks"]
["15ffff014","Žľab 4bm",{"$f":"_xlfn.XLOOKUP(VALUE(REPLACE(A10,3,4,7021)),'[1]Worksheet 1'!$A$2:$A$18880,'[1]Worksheet 1'!$C$2:$C$18880)","v":10.95},{"$f":"C10*(1-$H$2/100)","v":10.95},90,"ks"]
{"$rows_left_out":64}
{"sheet":"KRONOPLAST-hlavice, priechodky","index":12,"n_rows":32,"n_cols":17,"rows_kept":32,"cut":false,"hidden":false,"merged":[[8,16,9,16],[28,1,28,6],[28,7,28,13],[17,1,17,6],[18,7,18,15],[19,2,19,5],[18,2,18,5],[20,2,20,4],[21,2,21,4],[22,2,22,4],[24,2,24,4],[23,2,23,4],[25,2,25,4],[26,2,26,4],[27,2,27,4],[6,7,6,15],[0,7,0,8],[1,7,1,8],[13,7,13,15],[6,1,6,6],[13,1,13,6]]}
[null,null,null,null,null,null,null,"Vaša zľava v %"]
[null,null,null,null,null,null,null,0]
[null,null,null,null,null,null,null,"Ceny sú uvádzané bez DPH."]
[]
[]
[]
[null,"Ventilačné hlavice ECOLINE a ROTOLINE",null,null,null,null,null,"Objednané množstvá"]
["PLU","Model","Cena","Cena po zľave","Priemer",null,"MJ",3009,6020,7016,7024,7036,8004,8017,8019,9005,"Obrázok"]
[2000,"Ecoline Premium",40.700000000000003,{"$f":"C9*(1-$H$2/100)","v":40.700000000000003},125,null,"ks"]
[2019,"Ecoline Premium",{"$f":"230/4.4718","v":51.43342725524397},{"$f":"C10*(1-$H$2/100)","v":51.43342725524397},150,null,"ks"]
{"$rows_left_out":23}
{"sheet":"KRONOPLAST-ostatné","index":13,"n_rows":94,"n_cols":9,"rows_kept":94,"cut":false,"hidden":false,"merged":[[66,1,66,6],[72,8,75,8],[76,8,77,8],[78,8,79,8],[49,1,49,6],[54,8,55,8],[56,1,56,6],[22,1,22,6],[30,1,30,6],[38,1,38,6],[6,1,6,6],[8,8,11,8],[12,8,15,8],[16,8,19,8],[20,8,21,8]]}
[null,null,null,null,null,null,null,"Vaša zľava v %"]
[null,null,null,null,null,null,null,0]
[null,null,null,null,null,null,null,"Ceny sú uvádzané bez DPH."]
[]
[]
[]
[null,"Spojovacie rúry"]
["PLU","Model","Cena","Cena pre nás","Priemer","Dĺžka v cm","MJ","Objednané množstvá","Obrázok"]
[2221,"Pripojovacia rúra Kronoflex",{"$f":"65/4.4718","v":14.53553378952547},{"$f":"C9*(1-$H$2/100)","v":14.53553378952547},125,50,"ks"]
[null,"Pripojovacia rúra Kronoflex",{"$f":"95/4.4718","v":21.24424169238338},{"$f":"C10*(1-$H$2/100)","v":21.24424169238338},125,100,"ks"]
{"$rows_left_out":85}
{"sheet":"BAUDER - asfaltové pásy","index":14,"n_rows":59,"n_cols":9,"rows_kept":59,"cut":false,"hidden":false,"merged":[[50,1,50,8],[55,1,55,8],[6,1,6,8],[28,1,28,8],[39,1,39,8]]}
[1.75,null,null,null,null,null,null,null,"Vaša zľava v %"]
[null,null,null,null,null,null,null,null,0]
[null,null,null,null,null,null,null,null,"Ceny sú uvádzané bez DPH."]
[]
[]
[]
[null,"Vrchné pásy"]
["PLU","Produkt","Cena","Cena po zľave","Kód","bal/pal","Rozmer","MJ","Objednané množstvá"]
[{"$f":"CONCATENATE(2,E9)","v":"217732000"},"PYE PV 200 S5 EN",{"$f":"_xlfn.XLOOKUP(E9,'[2]ASFALTOVÉ PÁSY '!$C$7:$C$78,'[2]ASFALTOVÉ PÁSY '!$G$7:$G$78,\"-\")*$A$1","v":9.4149999999999991},{"$f":"C9*(1-$I$2/100)","v":9.4149999999999991},17732000,"5/120","5,2 mm","m2"]
[{"$f":"CONCATENATE(2,E10)","v":"217652000"},"PYE PV 200 S4 EN natursch.",{"$f":"_xlfn.XLOOKUP(E10,'[2]ASFALTOVÉ PÁSY '!$C$7:$C$78,'[2]ASFALTOVÉ PÁSY '!$G$7:$G$78,\"-\")*$A$1","v":8.0499999999999989},{"$f":"C10*(1-$I$2/100)","v":8.0499999999999989},17652000,"7,5/150","4,2 mm","m2"]
{"$rows_left_out":50}
{"sheet":"BAUDER - PVC,TPO fólie","index":15,"n_rows":63,"n_cols":8,"rows_kept":63,"cut":false,"hidden":false,"merged":[[33,1,33,7],[6,1,6,7]]}
[1.75,null,null,null,null,null,null,"Vaša zľava v %"]
[null,null,null,null,null,null,null,0]
[null,null,null,null,null,null,null,"Ceny sú uvádzané bez DPH."]
[]
[]
[]
[null,"PVC fólie"]
["PLU","Produkt","Cena","Cena po zľave","Kód","MJ","Rozmer, balenie","Objednané množstvá"]
[{"$f":"CONCATENATE(2,E9)","v":"261150000"},"Thermofol U 15",{"$f":"_xlfn.XLOOKUP(E9,'[2]PVC TPO FÓLIE'!$C$7:$C$71,'[2]PVC TPO FÓLIE'!$D$7:$D$71,\"-\")*$A$1","v":9.3449999999999989},{"$f":"C9*(1-$H$2/100)","v":9.3449999999999989},61150000,"m2","(hr.:1,5mm; 30m2/bal.; 480m2/pal.) "]
[{"$f":"CONCATENATE(2,E10)","v":"261180000"},"Thermofol U 18",{"$f":"_xlfn.XLOOKUP(E10,'[2]PVC TPO FÓLIE'!$C$7:$C$71,'[2]PVC TPO FÓLIE'!$D$7:$D$71,\"-\")*$A$1","v":11.025},{"$f":"C10*(1-$H$2/100)","v":11.025},61180000,"m2","(hr.:1,8mm; 30m2/bal.; 480m2/pal.) "]
{"$rows_left_out":54}
{"sheet":"BAUDER - PIR","index":16,"n_rows":56,"n_cols":8,"rows_kept":56,"cut":false,"hidden":false,"merged":[[18,1,18,6],[38,1,38,6],[7,1,7,6]]}
[1.75,null,null,null,null,null,null,"Vaša zľava v %"]
[null,null,null,null,null,null,null,0]
[null,null,null,null,null,null,null,"Ceny sú uvádzané bez DPH."]
[]
[]
[]
[null,"Produkt","Cena","Cena po zľave","Kód","Balenie","MJ"]
["PLU","PIR FA",null,null,null,null,null,"Objednané množstvá"]
[{"$f":"CONCATENATE(2,E9)","v":"245190060"},"Bauder PIR FA 60",{"$f":"_xlfn.XLOOKUP(E9,'[2]PIR '!$A$8:$A$160,'[2]PIR '!$F$8:$F$160,\"-\")*$A$1","v":16.502499999999998},{"$f":"C9*(1-$H$2/100)","v":16.502499999999998},45190060,14.4,"m2"]
[{"$f":"CONCATENATE(2,E10)","v":"245190080"},"Bauder PIR FA 80",{"$f":"_xlfn.XLOOKUP(E10,'[2]PIR '!$A$8:$A$160,'[2]PIR '!$F$8:$F$160,\"-\")*$A$1","v":19.810000000000002},{"$f":"C10*(1-$H$2/100)","v":19.810000000000002},45190080,11.52,"m2"]
{"$rows_left_out":47}
{"sheet":"BAUDER - PIR SD","index":17,"n_rows":70,"n_cols":8,"rows_kept":70,"cut":false,"hidden":false,"merged":[[42,1,42,6],[51,1,51,6],[7,1,7,6],[15,1,15,6],[25,1,25,6],[33,1,33,6],[35,1,35,6]]}
[1.75,null,null,null,null,null,null,"Vaša zľava v %"]
[null,null,null,null,null,null,null,0]
[null,null,null,null,null,null,null,"Ceny sú uvádzané bez DPH."]
[]
[]
[]
["PLU","Produkt","Cena","Cena po zľave","Kód","Rozmer/balenie","MJ"]
[null,"Bauder PIR PLUS",null,null,null,null,null,"Objednané množstvá"]
[{"$f":"CONCATENATE(2,E9)","v":"240380080"},"BauderPIR PLUS 80",{"$f":"_xlfn.XLOOKUP(E9,'[2]PIR SD'!$B$6:$B$56,'[2]PIR SD'!$G$6:$G$56,\"-\")*$A$1","v":31.360000000000003},{"$f":"C9*(1-$H$2/100)","v":31.360000000000003},"40380080","10,5 m2 v balení","m2"]
[{"$f":"CONCATENATE(2,E10)","v":"240380100"},"BauderPIR PLUS 100",{"$f":"_xlfn.XLOOKUP(E10,'[2]PIR SD'!$B$6:$B$56,'[2]PIR SD'!$G$6:$G$56,\"-\")*$A$1","v":35.49},{"$f":"C10*(1-$H$2/100)","v":35.49},"40380100","8,4 m2 v balení","m2"]
{"$rows_left_out":61}
{"sheet":"BAUDER - LES","index":18,"n_rows":13,"n_cols":8,"rows_kept":13,"cut":false,"hidden":false,"merged":[[7,1,7,4]]}
[1.75,null,null,null,null,null,null,"Vaša zľava v %"]
[null,null,null,null,null,null,null,0]
[null,null,null,null,null,null,null,"Ceny sú uvádzané bez DPH."]
[]
[]
[]
[null,"Produkt","Cena","Cena po zľave","MJ"]
["PLU","Bauder LES SET",null,null,null,"Objednané množstvá"]
[null,"PIR LES SET 1",{"$f":"_xlfn.XLOOKUP(B9,[2]LES!$B$3:$B$8,[2]LES!$C$3:$C$8,\"-\")*$A$1","v":28.699999999999996},{"$f":"C9*(1-$H$2/100)","v":28.699999999999996},"sada"]
[null,"PIR LES SET 2",{"$f":"_xlfn.XLOOKUP(B10,[2]LES!$B$3:$B$8,[2]LES!$C$3:$C$8,\"-\")*$A$1","v":64.75},{"$f":"C10*(1-$H$2/100)","v":64.75},"sada"]
{"$rows_left_out":4}
{"sheet":"PLECHY","index":19,"n_rows":89,"n_cols":19,"rows_kept":89,"cut":false,"hidden":false,"merged":[[0,7,0,8],[1,7,1,8],[61,18,71,18],[48,18,49,18],[50,18,60,18],[6,7,6,17],[84,18,88,18],[80,18,83,18],[7,1,7,6],[47,1,47,6],[17,18,35,18],[40,18,42,18],[43,18,44,18],[45,18,46,18],[78,18,79,18],[8,18,16,18],[36,1,36,7],[72,1,72,7]]}
[1.75,null,null,null,null,null,null,"Vaša zľava v %"]
[null,null,null,null,null,null,null,0]
[null,null,null,null,null,null,null,"Ceny sú uvádzané bez DPH."]
[]
[]
[]
["PLU","Produkt","Cena","Cena po zľave","Hrúbka","Rozmer","MJ","Objednané množstvá",null,null,null,null,null,null,null,null,null,null,"Obrázok"]
[null,"Lakoplastované plechy a pozinkované plechy",null,null,null,null,null,3009,3011,7016,8004,8017,8019,9002,9005,9006,9007,9010]
["ffff268","Lakoplastovaný plech, d. 2000 mm, tabuľový  STANDARD",{"$f":"_xlfn.XLOOKUP(VALUE(REPLACE(A9,1,4,7016)),'[1]Worksheet 1'!$A$2:$A$18880,'[1]Worksheet 1'!$C$2:$C$18880)","v":24.5},{"$f":"C9*(1-$H$2/100)","v":24.5},"0,50 mm","š. 1250 mm","ks"]
["ffff269","Lakoplastovaný plech, d. 30000 mm, zvitkový  STANDARD",{"$f":"_xlfn.XLOOKUP(VALUE(REPLACE(A10,1,4,7016)),'[1]Worksheet 1'!$A$2:$A$18880,'[1]Worksheet 1'!$C$2:$C$18880)","v":367.5},367.5,"0,50 mm","š. 1250 mm","ks"]
{"$rows_left_out":80}
{"sheet":"STREŠNÉ KRYTINY","index":20,"n_rows":42,"n_cols":10,"rows_kept":42,"cut":false,"hidden":false,"merged":[[39,9,41,9],[8,9,20,9],[7,1,7,9],[27,1,27,9],[28,9,31,9],[38,1,38,9]]}
[1.75,null,null,null,null,null,null,"Vaša zľava v %"]
[null,null,null,null,null,null,null,0]
[null,null,null,null,null,null,null,"Ceny sú uvádzané bez DPH za m2 krycej plochy krytiny."]
[]
[]
[]
["PLU","Model","Cena s fóliou","Cena po zľave","Hrúbka (mm)","R.š. (mm)","K.š. (mm)","MJ","Objednané množstvá","Obrázok"]
[null,"Strešná krytina SCHLEBACH"]
[null,"STANDARD (mat. LPL)",12.2,{"$f":"IFERROR(C9*(1-$H$2/100),\"-\")","v":12.2},"0,5 mm",625,550,"m2"]
[null,"ELEGANZ (mat. LPL)",12.6,12.6,"0,5 mm",625,550,"m2"]
{"$rows_left_out":33}
{"sheet":"DOPLNKY KU KRYTINÁM","index":21,"n_rows":118,"n_cols":9,"rows_kept":118,"cut":false,"hidden":false,"merged":[[69,7,71,7],[72,7,74,7],[75,7,77,7],[78,7,80,7],[69,8,71,8],[72,8,74,8],[75,8,77,8],[78,8,80,8],[60,4,62,4],[63,4,65,4],[66,4,68,4],[57,8,59,8],[60,7,62,7],[63,7,65,7],[66,7,68,7],[60,8,62,8],[63,8,65,8],[66,8,68,8],[53,1,53,8],[54,7,56,7],[54,8,56,8],[57,7,59,7],[44,7,46,7],[44,8,46,8],[47,7,49,7],[47,8,49,8],[50,7,52,7],[50,8,52,8],[54,4,56,4],[57,4,59,4],[50,4,52,4],[35,7,37,7],[35,8,37,8],[38,7,40,7],[38,8,40,8],[41,7,43,7],[41,8,43,8],[26,7,28,7],[26,8,28,8],[29,7,31,7],[29,8,31,8],[32,7,34,7],[32,8,34,8],[17,7,19,7],[17,8,19,8],[20,7,22,7],[20,8,22,8],[23,7,25,7],[23,8,25,8],[8,8,10,8],[11,7,13,7],[11,8,13,8],[14,7,16,7],[14,8,16,8],[8,7,10,7],[81,1,81,7],[84,1,84,7],[32,4,34,4],[7,1,7,6],[8,4,10,4],[11,4,13,4],[14,4,16,4],[17,4,19,4],[20,4,22,4],[23,4,25,4],[26,4,28,4],[29,4,31,4],[35,4,37,4],[38,4,40,4],[44,4,46,4],[47,4,49,4],[94,1,94,7],[95,7,97,7],[99,7,100,7],[102,7,103,7],[85,7,93,7],[110,7,111,7],[112,7,113,7],[116,7,117,7],[107,1,107,7],[104,1,104,7]]}
[1.75,null,null,null,null,null,null,"Vaša zľava v %"]
[null,null,null,null,null,null,null,0]
[null,null,null,null,null,null,null,"Ceny sú uvádzané bez DPH za m2 krycej plochy krytiny."]
[]
[]
[]
["PLU","Produkt","Cena ","Cena po zľave","Rozmer","MJ","Objednané množstvá","Obrázok","Nákres"]
[null,"Oplechovania k strešným krytinám CLIP PANEL a SCHLEBACH"]
[null,"Odkvapové lemovanie - STANDARD",4.5999999999999996,{"$f":"IFERROR(C9*(1-$H$2/100),\"-\")","v":4.5999999999999996},"r.š. 313 mm","m "]
[null,"Odkvapové lemovanie - ELEGANZ",4.8,4.8,null,"m "]
{"$rows_left_out":109}
{"sheet":"EVROMAT strešné krytiny","index":22,"n_rows":70,"n_cols":11,"rows_kept":70,"cut":false,"hidden":false,"merged":[[66,8,69,8],[66,9,69,9],[54,8,57,8],[54,9,57,9],[58,8,61,8],[58,9,61,9],[62,8,65,8],[62,9,65,9],[42,8,45,8],[42,9,45,9],[46,8,49,8],[46,9,49,9],[50,8,53,8],[50,9,53,9],[34,8,37,8],[34,9,37,9],[38,8,41,8],[38,9,41,9],[7,1,7,9],[9,9,12,9],[19,1,19,9],[21,9,23,9],[32,1,32,9],[30,10,30,13],[31,10,31,13],[26,9,26,13],[27,10,27,13],[28,10,28,13],[29,10,29,13]]}
[1.75,null,null,null,null,null,null,"Vaša zľava v %"]
[null,null,null,null,null,null,null,0]
[null,null,null,null,null,null,null,"Ceny sú uvádzané bez DPH za m2 krycej plochy krytiny."]
[]
[]
[]
[]
[null,"Strešná krytina EVROVLNA"]
["PLU","Model","Cena ","Cena po zľave","Hrúbka (mm)","R.š. (mm)","K.š. (mm)","MJ","Objednané množstvá","Obrázok"]
[null,"EVROVLNA (mat. PES)",12.2,{"$f":"IFERROR(C10*(1-$H$2/100),\"-\")","v":12.2},"0,5 mm",1250,1120,"m2"]
{"$rows_left_out":60}